Results 1 to 2 of 2
  1. #1


    Member Since
    May 21, 2010
    Posts
    3
    cilk language installation error
    i all;
    i'm using IMac with intel processor and i'm using Mac OS X 10.5.8 and i installed Cilk multithreading programming language ... but when i execute "make install" command after success full execution of ./configure, i get one error"error to execute to cilk2c" .... syntax error.

    below is the full description of the error... please give me solution as soon as possible..
    Making all in examples
    ../support/cilkclocal -DHAVE_CONFIG_H -I. -I.. -I../runtime -g -O2 -c -o fib.o fib.cilk
    /usr/include/mach/i386/_structs.h:97: syntax error

    Compilation Failed: 1 error, 0 warnings
    Error: failed running cilk2c
    make[2]: *** http://fib.o Error 1
    make[1]: *** all-recursive Error 1
    make: *** all Error 2

  2. #2


    Member Since
    May 21, 2010
    Posts
    3
    i found this solution from net , now can some body tell me what header file i want to fix...(change)... as soon as possible... thank you in advance..


    initial Error while calling Make install on MAC is this
    Making all in examples
    ../support/cilkclocal -DHAVE_CONFIG_H -I. -I.. -I../runtime -g -O2 -c -o fib.o fib.cilk
    /usr/include/mach/i386/_structs.h:97: syntax error
    Compilation Failed: 1 error, 0 warnings
    Error: failed running cilk2c
    make[2]: *** [fib.o] Error 1
    make[1]: *** [all-recursive] Error 1
    make: *** [all] Error 2

    Here is what we did to resolve this error

    => we read the error and figure out that the error is in running make file of example folder
    => In that example folder when the make file is compiling fib.cilk it is giving an error in syntax of header file
    => Further we open fib.cilk code and by going deeper into code found the following hierarchy

    => when we inspect that header file we found out that ate few places numbers are written without any variable, we commented those lines and save the header file
    => This changes work and that error gone with successful installation of cilk

Thread Information

Users Browsing this Thread

There are currently 1 users browsing this thread. (0 members and 1 guests)

Similar Threads

  1. Photoshop installation error
    By CafeRacer in forum Images, Graphic Design, and Digital Photography
    Replies: 1
    Last Post: 08-23-2011, 08:20 PM
  2. Cilk Language Intallation
    By bhuppi in forum OS X - Development and Darwin
    Replies: 2
    Last Post: 05-21-2010, 02:38 PM
  3. Installation Error
    By gilliatnet in forum OS X - Operating System
    Replies: 1
    Last Post: 06-15-2008, 04:08 AM
  4. mac os 10.4 gives error while installation??
    By sunnyhanda in forum OS X - Operating System
    Replies: 1
    Last Post: 11-24-2007, 03:49 PM
  5. Halo Installation Error???
    By iRizzo in forum Apple Notebooks
    Replies: 1
    Last Post: 06-05-2006, 04:16 PM

Posting Permissions

  • You may not post new threads
  • You may not post replies
  • You may not post attachments
  • You may not edit your posts
  •